Ubuntu Touch for OnePlus One


  • Administrators

    [size=x-large][color=#ff3333]WIP Status page:[/color][/size] [url=https://devices.ubports.com/#/bacon][size=x-large][color=#0000EE]https://devices.ubports.com/#/bacon[/color][/size][/url]

    [size=large][color=#ff3333]How to Build:[/color][/size] [url=http://wiki.ubports.com/index.php/OnePlus_One][size=large][color=#0000EE]http://wiki.ubports.com/index.php/OnePlus_One[/color][/size][/url]

    [size=large][color=#ff3333]How to Build:[/color][/size] [url=http://wiki.ubports.com/index.php/OnePlus_One_Build][size=large][color=#0000EE]http://wiki.ubports.com/index.php/OnePlus_One_Build[/color][/size][/url]

    [color=#10181f][font=Lato, 'Helvetica Neue', Helvetica, Arial, sans-serif][size=small]
    Build server: [color=#eb0028][url=http://ci.ubports.com/]http://ci.ubports.com/[/url][/color]
    Download server: [color=#eb0028][url=http://download.ubports.com/]http://download.ubports.com/[/url][/color]
    Nightly builds: [color=#eb0028][url=http://download.ubports.com/Ubuntu-Touch/OnePlus-One/nightly/]http://download.ubports.com/Ubuntu-Touch/OnePlus-One/nightly/[/url][/color][/size]
    [/font][/color]
    [b][color=#10181f][size=small][font=Lato, 'Helvetica Neue', Helvetica, Arial, sans-serif]Report bugs and errors here:[/font][/size][/color][/b][color=#10181f][size=small][font=Lato, 'Helvetica Neue', Helvetica, Arial, sans-serif] [/font][/size][/color][color=#eb0028][size=small][font=Lato, 'Helvetica Neue', Helvetica, Arial, sans-serif][url=https://github.com/ubuntu-touch-oneplus-one/ubuntu-touch-for-oneplus-one/issues]https://github.com/ubports/ubuntu-touch-for-oneplus-one/issues[/url][/font][/size][/color]

    [color=#333333][size=x-small]Comment down bellow for any questions, or start a new [color=#333333][font='Source Sans Pro', Tahoma, 'Helvetica Neue', Arial, sans-serif]threads[/font][/color].[/size][/color]



  • Nice forums you got here!
    How is the developement on Ubuntu Touch going?

    I bet you can use a beer : )
    I donated $5, good luck mate!



  • [quote='marcooo4' pid='7' dateline='1432245487']
    Nice forums you got here!
    How is the developement on Ubuntu Touch going?

    I bet you can use a beer : )
    I donated $5, good luck mate!
    [/quote]

    For development updates, take a look at this thread: http://forums.ubports.com/showthread.php?tid=4
    There mariogrip will post updates as often as he can.


  • Administrators

    [quote='marcooo4' pid='7' dateline='1432245487']
    Nice forums you got here!
    How is the developement on Ubuntu Touch going?

    I bet you can use a beer : )
    I donated $5, good luck mate!
    [/quote]

    Thanks :D



  • Is it possible you need to run your compiling as root, because it gives permission denied errors on the site which gives the broken builds or do you need to revert?


  • Administrators

    [quote='ub_touch_cedian' pid='27' dateline='1433866240']
    Is it possible you need to run your compiling as root, because it gives permission denied errors on the site which gives the broken builds or do you need to revert?
    [/quote]

    you shouldn't need to run it as root, I don't use sudo or root when im building (using ubuntu). can you provide some logs/output?



  • [quote='mariogrip' pid='29' dateline='1433891614']
    [quote='ub_touch_cedian' pid='27' dateline='1433866240']
    Is it possible you need to run your compiling as root, because it gives permission denied errors on the site which gives the broken builds or do you need to revert?
    [/quote]

    you shouldn't need to run it as root, I don't use sudo or root when im building (using ubuntu). can you provide some logs/output?
    [/quote]

    I've looked up, it fails at making the kernel etc.

    Here the full output:

    [code]Started by timer
    Building in workspace /var/lib/jenkins/jobs/Ubuntu_Touch_for_Oneplus_one/workspace
    [workspace] $ /bin/bash /tmp/hudson3540068062146418415.sh
    error: .repo/manifests/: contains uncommitted changes

    real 0m6.099s
    user 0m0.439s
    sys 0m0.222s
    including device/asus/deb/vendorsetup.sh
    including device/asus/tilapia/vendorsetup.sh
    including device/asus/flo/vendorsetup.sh
    including device/asus/grouper/vendorsetup.sh
    including device/generic/x86/vendorsetup.sh
    including device/generic/armv7-a-neon/vendorsetup.sh
    including device/samsung/manta/vendorsetup.sh
    including device/lge/hammerhead/vendorsetup.sh
    including device/lge/mako/vendorsetup.sh
    including device/oneplus/bacon/vendorsetup.sh
    including sdk/bash_completion/adb.bash
    mkdir: cannot create directory '/etc/firmware': Permission denied
    ln: failed to create symbolic link '/etc/firmware/wcd9320/wcd9320_anc.bin': No such file or directory
    ln: failed to create symbolic link '/etc/firmware/wcd9320/wcd9320_mbhc.bin': No such file or directory
    ln: failed to create symbolic link '/etc/firmware/wcd9320/wcd9320_mad_audio.bin': No such file or directory
    mkdir: cannot create directory '/etc/firmware': Permission denied
    ln: failed to create symbolic link '/etc/firmware/wlan/prima/WCNSS_qcom_cfg.ini': No such file or directory

    mkdir: cannot create directory '/etc/firmware': Permission denied
    ln: failed to create symbolic link '/etc/firmware/wcd9320/wcd9320_anc.bin': No such file or directory
    ln: failed to create symbolic link '/etc/firmware/wcd9320/wcd9320_mbhc.bin': No such file or directory
    ln: failed to create symbolic link '/etc/firmware/wcd9320/wcd9320_mad_audio.bin': No such file or directory
    mkdir: cannot create directory '/etc/firmware': Permission denied
    ln: failed to create symbolic link '/etc/firmware/wlan/prima/WCNSS_qcom_cfg.ini': No such file or directory
    mkdir: cannot create directory '/etc/firmware': Permission denied
    ln: failed to create symbolic link '/etc/firmware/wcd9320/wcd9320_anc.bin': No such file or directory
    ln: failed to create symbolic link '/etc/firmware/wcd9320/wcd9320_mbhc.bin': No such file or directory
    ln: failed to create symbolic link '/etc/firmware/wcd9320/wcd9320_mad_audio.bin': No such file or directory
    mkdir: cannot create directory '/etc/firmware': Permission denied
    ln: failed to create symbolic link '/etc/firmware/wlan/prima/WCNSS_qcom_cfg.ini': No such file or directory
    mkdir: cannot create directory '/etc/firmware': Permission denied
    ln: failed to create symbolic link '/etc/firmware/wcd9320/wcd9320_anc.bin': No such file or directory
    ln: failed to create symbolic link '/etc/firmware/wcd9320/wcd9320_mbhc.bin': No such file or directory
    ln: failed to create symbolic link '/etc/firmware/wcd9320/wcd9320_mad_audio.bin': No such file or directory
    mkdir: cannot create directory '/etc/firmware': Permission denied
    ln: failed to create symbolic link '/etc/firmware/wlan/prima/WCNSS_qcom_cfg.ini': No such file or directory
    mkdir: cannot create directory '/etc/firmware': Permission denied
    ln: failed to create symbolic link '/etc/firmware/wcd9320/wcd9320_anc.bin': No such file or directory
    ln: failed to create symbolic link '/etc/firmware/wcd9320/wcd9320_mbhc.bin': No such file or directory
    ln: failed to create symbolic link '/etc/firmware/wcd9320/wcd9320_mad_audio.bin': No such file or directory
    mkdir: cannot create directory '/etc/firmware': Permission denied
    ln: failed to create symbolic link '/etc/firmware/wlan/prima/WCNSS_qcom_cfg.ini': No such file or directory
    mkdir: cannot create directory '/etc/firmware': Permission denied
    ln: failed to create symbolic link '/etc/firmware/wcd9320/wcd9320_anc.bin': No such file or directory
    ln: failed to create symbolic link '/etc/firmware/wcd9320/wcd9320_mbhc.bin': No such file or directory
    ln: failed to create symbolic link '/etc/firmware/wcd9320/wcd9320_mad_audio.bin': No such file or directory
    mkdir: cannot create directory '/etc/firmware': Permission denied
    ln: failed to create symbolic link '/etc/firmware/wlan/prima/WCNSS_qcom_cfg.ini': No such file or directory
    mkdir: cannot create directory '/etc/firmware': Permission denied
    ln: failed to create symbolic link '/etc/firmware/wcd9320/wcd9320_anc.bin': No such file or directory
    ln: failed to create symbolic link '/etc/firmware/wcd9320/wcd9320_mbhc.bin': No such file or directory
    ln: failed to create symbolic link '/etc/firmware/wcd9320/wcd9320_mad_audio.bin': No such file or directory
    mkdir: cannot create directory '/etc/firmware': Permission denied
    ln: failed to create symbolic link '/etc/firmware/wlan/prima/WCNSS_qcom_cfg.ini': No such file or directory
    mkdir: cannot create directory '/etc/firmware': Permission denied
    ln: failed to create symbolic link '/etc/firmware/wcd9320/wcd9320_anc.bin': No such file or directory
    ln: failed to create symbolic link '/etc/firmware/wcd9320/wcd9320_mbhc.bin': No such file or directory
    ln: failed to create symbolic link '/etc/firmware/wcd9320/wcd9320_mad_audio.bin': No such file or directory
    mkdir: cannot create directory '/etc/firmware': Permission denied
    ln: failed to create symbolic link '/etc/firmware/wlan/prima/WCNSS_qcom_cfg.ini': No such file or directory
    mkdir: cannot create directory '/etc/firmware': Permission denied
    ln: failed to create symbolic link '/etc/firmware/wcd9320/wcd9320_anc.bin': No such file or directory
    ln: failed to create symbolic link '/etc/firmware/wcd9320/wcd9320_mbhc.bin': No such file or directory
    ln: failed to create symbolic link '/etc/firmware/wcd9320/wcd9320_mad_audio.bin': No such file or directory
    mkdir: cannot create directory '/etc/firmware': Permission denied
    ln: failed to create symbolic link '/etc/firmware/wlan/prima/WCNSS_qcom_cfg.ini': No such file or directory
    mkdir: cannot create directory '/etc/firmware': Permission denied
    ln: failed to create symbolic link '/etc/firmware/wcd9320/wcd9320_anc.bin': No such file or directory
    ln: failed to create symbolic link '/etc/firmware/wcd9320/wcd9320_mbhc.bin': No such file or directory
    ln: failed to create symbolic link '/etc/firmware/wcd9320/wcd9320_mad_audio.bin': No such file or directory
    mkdir: cannot create directory '/etc/firmware': Permission denied
    ln: failed to create symbolic link '/etc/firmware/wlan/prima/WCNSS_qcom_cfg.ini': No such file or directory

    PLATFORM_VERSION_CODENAME=REL
    PLATFORM_VERSION=4.4.2
    TARGET_PRODUCT=aosp_bacon
    TARGET_BUILD_VARIANT=userdebug
    TARGET_BUILD_TYPE=release
    TARGET_BUILD_APPS=
    TARGET_ARCH=arm
    TARGET_ARCH_VARIANT=armv7-a-neon
    TARGET_CPU_VARIANT=krait
    HOST_ARCH=x86
    HOST_OS=linux
    HOST_OS_EXTRA=Linux-2.6.32-042stab094.7-x86_64-with-Ubuntu-14.04-trusty
    HOST_BUILD_TYPE=release
    BUILD_ID=KOT49H
    OUT_DIR=/var/lib/jenkins/phablet/out

    mkdir: cannot create directory '/etc/firmware': Permission denied
    ln: failed to create symbolic link '/etc/firmware/wcd9320/wcd9320_anc.bin': No such file or directory
    ln: failed to create symbolic link '/etc/firmware/wcd9320/wcd9320_mbhc.bin': No such file or directory
    ln: failed to create symbolic link '/etc/firmware/wcd9320/wcd9320_mad_audio.bin': No such file or directory
    mkdir: cannot create directory '/etc/firmware': Permission denied
    ln: failed to create symbolic link '/etc/firmware/wlan/prima/WCNSS_qcom_cfg.ini': No such file or directory

    PLATFORM_VERSION_CODENAME=REL
    PLATFORM_VERSION=4.4.2
    TARGET_PRODUCT=aosp_bacon
    TARGET_BUILD_VARIANT=userdebug
    TARGET_BUILD_TYPE=release
    TARGET_BUILD_APPS=
    TARGET_ARCH=arm
    TARGET_ARCH_VARIANT=armv7-a-neon
    TARGET_CPU_VARIANT=krait
    HOST_ARCH=x86
    HOST_OS=linux
    HOST_OS_EXTRA=Linux-2.6.32-042stab094.7-x86_64-with-Ubuntu-14.04-trusty
    HOST_BUILD_TYPE=release
    BUILD_ID=KOT49H
    OUT_DIR=/var/lib/jenkins/phablet/out

    including abi/cpp/Android.mk ...
    including bionic/Android.mk ...
    including bootable/recovery/Android.mk ...
    including build/libs/host/Android.mk ...
    including build/target/board/Android.mk ...
    including build/tools/acp/Android.mk ...
    including build/tools/check_prereq/Android.mk ...
    including build/tools/fs_config/Android.mk ...
    including build/tools/zipalign/Android.mk ...
    including device/asus/deb/dumpstate/Android.mk ...
    including device/asus/deb/recovery/Android.mk ...
    including device/asus/deb/self-extractors/Android.mk ...
    including device/asus/flo/Android.mk ...
    including device/asus/grouper/Android.mk ...
    including device/asus/tilapia/recovery/Android.mk ...
    including device/asus/tilapia/self-extractors/Android.mk ...
    including device/generic/goldfish/audio/Android.mk ...
    including device/generic/goldfish/camera/Android.mk ...
    including device/generic/goldfish/gps/Android.mk ...
    including device/generic/goldfish/lights/Android.mk ...
    including device/generic/goldfish/opengl/Android.mk ...
    including device/generic/goldfish/power/Android.mk ...
    including device/generic/goldfish/qemu-props/Android.mk ...
    including device/generic/goldfish/qemud/Android.mk ...
    including device/generic/goldfish/sensors/Android.mk ...
    including device/lge/hammerhead/Android.mk ...
    including device/lge/mako/Android.mk ...
    including device/samsung/manta/Android.mk ...
    including external/aac/Android.mk ...
    including external/busybox/Android.mk ...
    including external/bzip2/Android.mk ...
    including external/checkpolicy/Android.mk ...
    including external/e2fsprogs/Android.mk ...
    including external/expat/Android.mk ...
    including external/flac/Android.mk ...
    including external/freetype/Android.mk ...
    including external/fsck_msdos/Android.mk ...
    including external/gcc-demangle/Android.mk ...
    including external/genext2fs/Android.mk ...
    including external/giflib/Android.mk ...
    including external/gtest/Android.mk ...
    including external/icu4c/Android.mk ...
    including external/jhead/Android.mk ...
    including external/jpeg/Android.mk ...
    including external/libgsm/Android.mk ...
    including external/liblzf/Android.mk ...
    including external/libpng/Android.mk ...
    including external/libselinux/Android.mk ...
    including external/libsepol/Android.mk ...
    including external/libvpx/Android.mk ...
    including external/mksh/Android.mk ...
    including external/openssl/Android.mk ...
    including external/pigz/Android.mk ...
    including external/protobuf/Android.mk ...
    including external/qemu/Android.mk ...
    including external/scrypt/Android.mk ...
    including external/sepolicy/Android.mk ...
    including external/sfntly/Android.mk ...
    including external/skia/Android.mk ...
    including external/sonivox/Android.mk ...
    including external/speex/Android.mk ...
    including external/sqlite/android/Android.mk ...
    including external/sqlite/dist/Android.mk ...
    including external/stlport/Android.mk ...
    including external/tinyalsa/Android.mk ...
    including external/tinycompress/Android.mk ...
    including external/tremolo/Android.mk ...
    including external/webp/Android.mk ...
    including external/webrtc/Android.mk ...
    including external/wpa_supplicant_8/Android.mk ...
    including external/yaffs2/Android.mk ...
    including external/zlib/Android.mk ...
    including frameworks/av/camera/Android.mk ...
    including frameworks/av/drm/common/Android.mk ...
    including frameworks/av/drm/drmserver/Android.mk ...
    including frameworks/av/drm/libdrmframework/Android.mk ...
    including frameworks/av/drm/mediadrm/plugins/mock/Android.mk ...
    including frameworks/av/media/common_time/Android.mk ...
    including frameworks/av/media/libcpustats/Android.mk ...
    including frameworks/av/media/libeffects/downmix/Android.mk ...
    including frameworks/av/media/libeffects/factory/Android.mk ...
    including frameworks/av/media/libeffects/loudness/Android.mk ...
    including frameworks/av/media/libeffects/lvm/lib/Android.mk ...
    including frameworks/av/media/libeffects/lvm/wrapper/Android.mk ...
    including frameworks/av/media/libeffects/preprocessing/Android.mk ...
    including frameworks/av/media/libeffects/proxy/Android.mk ...
    including frameworks/av/media/libeffects/visualizer/Android.mk ...
    including frameworks/av/media/libmedia/Android.mk ...
    including frameworks/av/media/libmediaplayerservice/Android.mk ...
    including frameworks/av/media/libnbaio/Android.mk ...
    including frameworks/av/media/libstagefright/Android.mk ...
    including frameworks/av/media/mediaserver/Android.mk ...
    including frameworks/av/services/audioflinger/Android.mk ...
    including frameworks/av/services/camera/libcameraservice/Android.mk ...
    including frameworks/av/services/medialog/Android.mk ...
    including frameworks/base/cmds/bootanimation/Android.mk ...
    including frameworks/base/cmds/screencap/Android.mk ...
    including frameworks/base/libs/androidfw/Android.mk ...
    including frameworks/base/services/input/Android.mk ...
    including frameworks/base/tools/aapt/Android.mk ...
    including frameworks/native/cmds/installd/Android.mk ...
    including frameworks/native/cmds/servicemanager/Android.mk ...
    including frameworks/native/libs/binder/Android.mk ...
    including frameworks/native/libs/diskusage/Android.mk ...
    including frameworks/native/libs/gui/Android.mk ...
    including frameworks/native/libs/input/Android.mk ...
    including frameworks/native/libs/ui/Android.mk ...
    including frameworks/native/opengl/libagl/Android.mk ...
    including frameworks/native/opengl/libs/Android.mk ...
    including frameworks/native/opengl/tests/Android.mk ...
    including frameworks/native/services/batteryservice/Android.mk ...
    including frameworks/native/services/connectivitymanager/Android.mk ...
    including frameworks/native/services/powermanager/Android.mk ...
    including frameworks/native/services/sensorservice/Android.mk ...
    including frameworks/native/services/surfaceflinger/Android.mk ...
    including frameworks/opt/emoji/Android.mk ...
    including hardware/akm/AK8975_FS/akmdfs/Android.mk ...
    including hardware/akm/AK8975_FS/libsensors/Android.mk ...
    including hardware/broadcom/libbt/Android.mk ...
    including hardware/broadcom/wlan/bcmdhd/Android.mk ...
    including hardware/invensense/Android.mk ...
    including hardware/libhardware/Android.mk ...
    including hardware/libhardware_legacy/Android.mk ...
    including hardware/qcom/audio/Android.mk ...
    including hardware/qcom/bt/Android.mk ...
    including hardware/qcom/camera/Android.mk ...
    including hardware/qcom/display/Android.mk ...
    build/core/copy_headers.mk:15: warning: overriding commands for target /var/lib/jenkins/phablet/out/target/product/bacon/obj/include/qcom/display/copybit.h' build/core/copy_headers.mk:15: warning: ignoring old commands for target/var/lib/jenkins/phablet/out/target/product/bacon/obj/include/qcom/display/copybit.h'
    build/core/copy_headers.mk:15: warning: overriding commands for target /var/lib/jenkins/phablet/out/target/product/bacon/obj/include/qcom/display/copybit_priv.h' build/core/copy_headers.mk:15: warning: ignoring old commands for target/var/lib/jenkins/phablet/out/target/product/bacon/obj/include/qcom/display/copybit_priv.h'
    including hardware/qcom/keymaster/Android.mk ...
    including hardware/qcom/media-caf-new/Android.mk ...
    including hardware/qcom/power/Android.mk ...
    including hardware/qcom/wlan/qcwcn/Android.mk ...
    including hardware/ril/libril/Android.mk ...
    including hardware/ril/librilutils/Android.mk ...
    including hardware/ril/reference-ril/Android.mk ...
    including hardware/ril/rild/Android.mk ...
    including hardware/samsung_slsi/exynos5/Android.mk ...
    including hardware/ti/omap3/Android.mk ...
    including hardware/ti/omap4xxx/Android.mk ...
    including hardware/ti/wlan/mac80211/Android.mk ...
    including hardware/ti/wpan/Android.mk ...
    including prebuilts/tools/linux-x86/sdl/Android.mk ...
    including sdk/emulator/mksdcard/Android.mk ...
    including sdk/emulator/opengl/Android.mk ...
    including sdk/emulator/qtools/Android.mk ...
    including system/core/Android.mk ...
    including system/extras/ext4_utils/Android.mk ...
    including system/media/audio_route/Android.mk ...
    including system/media/audio_utils/Android.mk ...
    including system/media/camera/src/Android.mk ...
    including system/media/camera/tests/Android.mk ...
    including system/security/keystore/Android.mk ...
    including system/security/softkeymaster/Android.mk ...
    including system/vold/Android.mk ...
    including ubuntu/assets/Android.mk ...
    including ubuntu/libhybris/compat/camera/Android.mk ...
    including ubuntu/libhybris/compat/input/Android.mk ...
    including ubuntu/libhybris/compat/media/Android.mk ...
    including ubuntu/libhybris/compat/surface_flinger/Android.mk ...
    including ubuntu/libhybris/compat/ui/Android.mk ...
    including ubuntu/platform-api/android/hybris/Android.mk ...
    including ubuntu/upstart-property-watcher/Android.mk ...
    build/core/Makefile:32: warning: overriding commands for target /var/lib/jenkins/phablet/out/target/product/bacon/system/etc/apns-conf.xml' build/core/base_rules.mk:529: warning: ignoring old commands for target/var/lib/jenkins/phablet/out/target/product/bacon/system/etc/apns-conf.xml'
    PRODUCT_COPY_FILES device/sample/etc/apns-full-conf.xml:system/etc/apns-conf.xml ignored.
    PRODUCT_COPY_FILES device/oppo/msm8974-common/audio/audio_policy.conf:system/etc/audio_policy.conf ignored.
    PRODUCT_COPY_FILES device/oppo/msm8974-common/audio/mixer_paths.xml:system/etc/mixer_paths.xml ignored.
    No private recovery resources for TARGET_DEVICE bacon
    device/oneplus/bacon/mkbootimg.mk:47: warning: overriding commands for target /var/lib/jenkins/phablet/out/target/product/bacon/boot.img' build/core/Makefile:489: warning: ignoring old commands for target/var/lib/jenkins/phablet/out/target/product/bacon/boot.img'
    make -C kernel/oneplus/msm8974 O=/var/lib/jenkins/phablet/out/target/product/bacon/obj/KERNEL_OBJ ARCH=arm CROSS_COMPILE=" /var/lib/jenkins/phablet/prebuilts/gcc/linux-x86/arm/arm-eabi-4.7/bin/arm-eabi-" VARIANT_DEFCONFIG= SELINUX_DEFCONFIG= cyanogenmod_bacon_defconfig
    make[1]: Entering directory `/var/lib/jenkins/phablet/kernel/oneplus/msm8974'
    GEN /var/lib/jenkins/phablet/out/target/product/bacon/obj/KERNEL_OBJ/Makefile
    arch/arm/configs/cyanogenmod_bacon_defconfig:3598:warning: override: reassigning to symbol DEFAULT_SECURITY
    arch/arm/configs/cyanogenmod_bacon_defconfig:3605:warning: override: reassigning to symbol DEFAULT_MMAP_MIN_ADDR
    arch/arm/configs/cyanogenmod_bacon_defconfig:3606:warning: override: reassigning to symbol DEFAULT_IOSCHED

    configuration written to .config

    make[1]: Leaving directory /var/lib/jenkins/phablet/kernel/oneplus/msm8974' make -C kernel/oneplus/msm8974 O=/var/lib/jenkins/phablet/out/target/product/bacon/obj/KERNEL_OBJ ARCH=arm CROSS_COMPILE=" /var/lib/jenkins/phablet/prebuilts/gcc/linux-x86/arm/arm-eabi-4.7/bin/arm-eabi-" headers_install make[1]: Entering directory/var/lib/jenkins/phablet/kernel/oneplus/msm8974'
    CHK include/linux/version.h
    make[1]: Leaving directory /var/lib/jenkins/phablet/kernel/oneplus/msm8974' make -C kernel/oneplus/msm8974 O=/var/lib/jenkins/phablet/out/target/product/bacon/obj/KERNEL_OBJ ARCH=arm CROSS_COMPILE=" /var/lib/jenkins/phablet/prebuilts/gcc/linux-x86/arm/arm-eabi-4.7/bin/arm-eabi-" zImage make[1]: Entering directory/var/lib/jenkins/phablet/kernel/oneplus/msm8974'
    GEN /var/lib/jenkins/phablet/out/target/product/bacon/obj/KERNEL_OBJ/Makefile
    scripts/kconfig/conf --silentoldconfig Kconfig
    Using /var/lib/jenkins/phablet/kernel/oneplus/msm8974 as source for kernel
    GEN /var/lib/jenkins/phablet/out/target/product/bacon/obj/KERNEL_OBJ/Makefile
    CHK include/linux/version.h
    CHK include/generated/utsrelease.h
    make[3]: include/generated/mach-types.h' is up to date. CALL /var/lib/jenkins/phablet/kernel/oneplus/msm8974/scripts/checksyscalls.sh CHK include/generated/compile.h GZIP kernel/config_data.gz CHK kernel/config_data.h Kernel: arch/arm/boot/Image is ready XZKERN arch/arm/boot/compressed/piggy.xzkern AS arch/arm/boot/compressed/piggy.xzkern.o LD arch/arm/boot/compressed/vmlinux OBJCOPY arch/arm/boot/zImage Kernel: arch/arm/boot/zImage is ready make[1]: Leaving directory/var/lib/jenkins/phablet/kernel/oneplus/msm8974'
    make -C kernel/oneplus/msm8974 O=/var/lib/jenkins/phablet/out/target/product/bacon/obj/KERNEL_OBJ ARCH=arm CROSS_COMPILE=" /var/lib/jenkins/phablet/prebuilts/gcc/linux-x86/arm/arm-eabi-4.7/bin/arm-eabi-" modules
    make[1]: Entering directory `/var/lib/jenkins/phablet/kernel/oneplus/msm8974'

    The present kernel configuration has modules disabled.
    Type 'make config' and enable loadable module support.
    Then build a kernel with module support enabled.

    make[2]: *** [modules] Error 1
    make[1]: *** [sub-make] Error 2
    make[1]: Leaving directory /var/lib/jenkins/phablet/kernel/oneplus/msm8974' make: [TARGET_KERNEL_BINARIES] Error 2 (ignored) make -C kernel/oneplus/msm8974 O=/var/lib/jenkins/phablet/out/target/product/bacon/obj/KERNEL_OBJ INSTALL_MOD_PATH=../../system ARCH=arm CROSS_COMPILE=" /var/lib/jenkins/phablet/prebuilts/gcc/linux-x86/arm/arm-eabi-4.7/bin/arm-eabi-" modules_install make[1]: Entering directory/var/lib/jenkins/phablet/kernel/oneplus/msm8974'

    The present kernel configuration has modules disabled.
    Type 'make config' and enable loadable module support.
    Then build a kernel with module support enabled.

    make[2]: *** [modules_install] Error 1
    make[1]: *** [sub-make] Error 2
    make[1]: Leaving directory /var/lib/jenkins/phablet/kernel/oneplus/msm8974' make: [TARGET_KERNEL_BINARIES] Error 2 (ignored) mdpath=find /var/lib/jenkins/phablet/out/target/product/bacon/system/lib/modules -type f -name modules.order; if [ "$mdpath" != "" ];then mpath=dirname $mdpath; ko=find $mpath/kernel -type f -name *.ko; for i in $ko; do /var/lib/jenkins/phablet/prebuilts/gcc/linux-x86/arm/arm-eabi-4.7/bin/arm-eabi-strip --strip-unneeded $i; mv $i /var/lib/jenkins/phablet/out/target/product/bacon/system/lib/modules/; done; fi find:/var/lib/jenkins/phablet/out/target/product/bacon/system/lib/modules': No such file or directory
    mdpath=find /var/lib/jenkins/phablet/out/target/product/bacon/system/lib/modules -type f -name modules.order; if [ "$mdpath" != "" ];then mpath=dirname $mdpath; rm -rf $mpath; fi
    find: /var/lib/jenkins/phablet/out/target/product/bacon/system/lib/modules': No such file or directory mdpath=find /var/lib/jenkins/phablet/out/target/product/bacon/system/lib/modules -type f -name modules.order; if [ "$mdpath" != "" ];then mpath=dirname $mdpath; ko=find $mpath/kernel -type f -name *.ko; for i in $ko; do /var/lib/jenkins/phablet/prebuilts/gcc/linux-x86/arm/arm-eabi-4.7/bin/arm-eabi-strip --strip-unneeded $i; mv $i /var/lib/jenkins/phablet/out/target/product/bacon/system/lib/modules/; done; fi find:/var/lib/jenkins/phablet/out/target/product/bacon/system/lib/modules': No such file or directory
    mdpath=find /var/lib/jenkins/phablet/out/target/product/bacon/system/lib/modules -type f -name modules.order; if [ "$mdpath" != "" ];then mpath=dirname $mdpath; rm -rf $mpath; fi
    find: `/var/lib/jenkins/phablet/out/target/product/bacon/system/lib/modules': No such file or directory
    target Prebuilt: (/var/lib/jenkins/phablet/out/target/product/bacon/kernel)
    build/tools/generate-notice-files.py /var/lib/jenkins/phablet/out/target/product/bacon/obj/NOTICE.txt /var/lib/jenkins/phablet/out/target/product/bacon/obj/NOTICE.html "Notices for files contained in the filesystem images in this directory:" /var/lib/jenkins/phablet/out/target/product/bacon/obj/NOTICE_FILES/src
    Combining NOTICE files into HTML
    Combining NOTICE files into text
    Start DT image: /var/lib/jenkins/phablet/out/target/product/bacon/dt.img
    mkdir -p /var/lib/jenkins/phablet/out/target/product/bacon/obj/KERNEL_OBJ/arch/arm/boot; /var/lib/jenkins/phablet/out/target/product/bacon/obj/KERNEL_OBJ/scripts/dtc/dtc -p 1024 -O dtb -o /var/lib/jenkins/phablet/out/target/product/bacon/obj/KERNEL_OBJ/arch/arm/boot/msm8974pro-ab-pm8941-a0001.dtb ./kernel/oneplus/msm8974/arch/arm/boot/dts/msm8974pro-ab-pm8941-a0001.dts; cat /var/lib/jenkins/phablet/out/target/product/bacon/obj/KERNEL_OBJ/arch/arm/boot/zImage /var/lib/jenkins/phablet/out/target/product/bacon/obj/KERNEL_OBJ/arch/arm/boot/msm8974pro-ab-pm8941-a0001.dtb > /var/lib/jenkins/phablet/out/target/product/bacon/obj/KERNEL_OBJ/arch/arm/boot/msm8974pro-ab-pm8941-a0001-zImage; /var/lib/jenkins/phablet/out/target/product/bacon/obj/KERNEL_OBJ/scripts/dtc/dtc -p 1024 -O dtb -o /var/lib/jenkins/phablet/out/target/product/bacon/obj/KERNEL_OBJ/arch/arm/boot/msm8974pro-ac-pm8941-a0001.dtb ./kernel/oneplus/msm8974/arch/arm/boot/dts/msm8974pro-ac-pm8941-a0001.dts; cat /var/lib/jenkins/phablet/out/target/product/bacon/obj/KERNEL_OBJ/arch/arm/boot/zImage /var/lib/jenkins/phablet/out/target/product/bacon/obj/KERNEL_OBJ/arch/arm/boot/msm8974pro-ac-pm8941-a0001.dtb > /var/lib/jenkins/phablet/out/target/product/bacon/obj/KERNEL_OBJ/arch/arm/boot/msm8974pro-ac-pm8941-a0001-zImage;
    Warning (reg_format): "reg" property in /soc/spi@f9923000 is empty
    Warning (reg_format): "reg" property in /soc/spi@f9923000 is empty
    Target dt image: /var/lib/jenkins/phablet/out/target/product/bacon/dt.img
    DTB combiner:
    Input directory: '/var/lib/jenkins/phablet/out/target/product/bacon/obj/KERNEL_OBJ/arch/arm/boot/'
    Output file: '/var/lib/jenkins/phablet/out/target/product/bacon/dt.img'
    Found file: msm8974pro-ab-pm8941-a0001.dtb ... chipset: 208, rev: 65536, platform: 8, subtype: 0
    additional chipset: 209, rev: 65536, platform: 8, subtype: 0
    additional chipset: 211, rev: 65536, platform: 8, subtype: 0
    additional chipset: 212, rev: 65536, platform: 8, subtype: 0
    additional chipset: 214, rev: 65536, platform: 8, subtype: 0
    additional chipset: 215, rev: 65536, platform: 8, subtype: 0
    additional chipset: 217, rev: 65536, platform: 8, subtype: 0
    additional chipset: 218, rev: 65536, platform: 8, subtype: 0
    Found file: msm8974pro-ac-pm8941-a0001.dtb ... chipset: 194, rev: 65536, platform: 8, subtype: 0
    additional chipset: 210, rev: 65536, platform: 8, subtype: 0
    additional chipset: 213, rev: 65536, platform: 8, subtype: 0
    additional chipset: 216, rev: 65536, platform: 8, subtype: 0
    => Found 12 unique DTB(s)

    Generating master DTB... completed
    Made DT image: /var/lib/jenkins/phablet/out/target/product/bacon/dt.img
    Target Ubuntu Touch ram disk: /var/lib/jenkins/phablet/out/target/product/bacon/ramdisk.img
    Downloading ubuntu-touch-generic-initrd version 0.94
    14610 blocks
    ----- Making recovery image ------
    Copying baseline ramdisk...
    Modifying ramdisk contents...
    cp: cannot stat '/var/lib/jenkins/phablet/out/target/product/bacon/root/init.recovery..rc': No such file or directory
    make: [/var/lib/jenkins/phablet/out/target/product/bacon/recovery/root.ts] Error 1 (ignored)
    mkdir -p /var/lib/jenkins/phablet/out/target/product/bacon/recovery/root/system/bin
    Modifying default.prop
    sed -i 's/ro.build.date.utc=.
    /ro.build.date.utc=0/g' /var/lib/jenkins/phablet/out/target/product/bacon/recovery/root/default.prop
    sed -i 's/ro.adb.secure=1//g' /var/lib/jenkins/phablet/out/target/product/bacon/recovery/root/default.prop
    ----- Made recovery filesystem --------/var/lib/jenkins/phablet/out/target/product/bacon/recovery/root
    ----- Making uncompressed recovery ramdisk ------
    /var/lib/jenkins/phablet/out/host/linux-x86/bin/mkbootfs /var/lib/jenkins/phablet/out/target/product/bacon/recovery/root > /var/lib/jenkins/phablet/out/target/product/bacon/ramdisk-recovery.cpio
    ----- Making recovery ramdisk ------
    /var/lib/jenkins/phablet/out/host/linux-x86/bin/minigzip < /var/lib/jenkins/phablet/out/target/product/bacon/ramdisk-recovery.cpio > /var/lib/jenkins/phablet/out/target/product/bacon/ramdisk-recovery.img
    ----- Making recovery image ------
    usage: mkbootimg
    --kernel <filename>
    --ramdisk <filename>
    [ --second <2ndbootloader-filename> ]
    [ --cmdline <kernel-commandline> ]
    [ --board <boardname> ]
    [ --base <address> ]
    [ --pagesize <pagesize> ]
    -o|--output <filename>
    make: *** [/var/lib/jenkins/phablet/out/target/product/bacon/recovery.img] Error 1

    real 3m32.027s
    user 0m49.288s
    sys 0m14.751s
    Build step 'Execute shell' marked build as failure
    Finished: FAILURE[/code]


  • Administrators

    [quote='ub_touch_cedian' pid='30' dateline='1433921084']
    [quote='mariogrip' pid='29' dateline='1433891614']
    [quote='ub_touch_cedian' pid='27' dateline='1433866240']
    Is it possible you need to run your compiling as root, because it gives permission denied errors on the site which gives the broken builds or do you need to revert?
    [/quote]

    you shouldn't need to run it as root, I don't use sudo or root when im building (using ubuntu). can you provide some logs/output?
    [/quote]

    I've looked up, it fails at making the kernel etc.

    Here the full output:

    [code]Started by timer
    Building in workspace /var/lib/jenkins/jobs/Ubuntu_Touch_for_Oneplus_one/workspace
    [workspace] $ /bin/bash /tmp/hudson3540068062146418415.sh
    error: .repo/manifests/: contains uncommitted changes

    real 0m6.099s
    user 0m0.439s
    sys 0m0.222s
    including device/asus/deb/vendorsetup.sh
    including device/asus/tilapia/vendorsetup.sh
    including device/asus/flo/vendorsetup.sh
    including device/asus/grouper/vendorsetup.sh
    including device/generic/x86/vendorsetup.sh
    including device/generic/armv7-a-neon/vendorsetup.sh
    including device/samsung/manta/vendorsetup.sh
    including device/lge/hammerhead/vendorsetup.sh
    including device/lge/mako/vendorsetup.sh
    including device/oneplus/bacon/vendorsetup.sh
    including sdk/bash_completion/adb.bash
    mkdir: cannot create directory '/etc/firmware': Permission denied
    ln: failed to create symbolic link '/etc/firmware/wcd9320/wcd9320_anc.bin': No such file or directory
    ln: failed to create symbolic link '/etc/firmware/wcd9320/wcd9320_mbhc.bin': No such file or directory
    ln: failed to create symbolic link '/etc/firmware/wcd9320/wcd9320_mad_audio.bin': No such file or directory
    mkdir: cannot create directory '/etc/firmware': Permission denied
    ln: failed to create symbolic link '/etc/firmware/wlan/prima/WCNSS_qcom_cfg.ini': No such file or directory

    mkdir: cannot create directory '/etc/firmware': Permission denied
    ln: failed to create symbolic link '/etc/firmware/wcd9320/wcd9320_anc.bin': No such file or directory
    ln: failed to create symbolic link '/etc/firmware/wcd9320/wcd9320_mbhc.bin': No such file or directory
    ln: failed to create symbolic link '/etc/firmware/wcd9320/wcd9320_mad_audio.bin': No such file or directory
    mkdir: cannot create directory '/etc/firmware': Permission denied
    ln: failed to create symbolic link '/etc/firmware/wlan/prima/WCNSS_qcom_cfg.ini': No such file or directory
    mkdir: cannot create directory '/etc/firmware': Permission denied
    ln: failed to create symbolic link '/etc/firmware/wcd9320/wcd9320_anc.bin': No such file or directory
    ln: failed to create symbolic link '/etc/firmware/wcd9320/wcd9320_mbhc.bin': No such file or directory
    ln: failed to create symbolic link '/etc/firmware/wcd9320/wcd9320_mad_audio.bin': No such file or directory
    mkdir: cannot create directory '/etc/firmware': Permission denied
    ln: failed to create symbolic link '/etc/firmware/wlan/prima/WCNSS_qcom_cfg.ini': No such file or directory
    mkdir: cannot create directory '/etc/firmware': Permission denied
    ln: failed to create symbolic link '/etc/firmware/wcd9320/wcd9320_anc.bin': No such file or directory
    ln: failed to create symbolic link '/etc/firmware/wcd9320/wcd9320_mbhc.bin': No such file or directory
    ln: failed to create symbolic link '/etc/firmware/wcd9320/wcd9320_mad_audio.bin': No such file or directory
    mkdir: cannot create directory '/etc/firmware': Permission denied
    ln: failed to create symbolic link '/etc/firmware/wlan/prima/WCNSS_qcom_cfg.ini': No such file or directory
    mkdir: cannot create directory '/etc/firmware': Permission denied
    ln: failed to create symbolic link '/etc/firmware/wcd9320/wcd9320_anc.bin': No such file or directory
    ln: failed to create symbolic link '/etc/firmware/wcd9320/wcd9320_mbhc.bin': No such file or directory
    ln: failed to create symbolic link '/etc/firmware/wcd9320/wcd9320_mad_audio.bin': No such file or directory
    mkdir: cannot create directory '/etc/firmware': Permission denied
    ln: failed to create symbolic link '/etc/firmware/wlan/prima/WCNSS_qcom_cfg.ini': No such file or directory
    mkdir: cannot create directory '/etc/firmware': Permission denied
    ln: failed to create symbolic link '/etc/firmware/wcd9320/wcd9320_anc.bin': No such file or directory
    ln: failed to create symbolic link '/etc/firmware/wcd9320/wcd9320_mbhc.bin': No such file or directory
    ln: failed to create symbolic link '/etc/firmware/wcd9320/wcd9320_mad_audio.bin': No such file or directory
    mkdir: cannot create directory '/etc/firmware': Permission denied
    ln: failed to create symbolic link '/etc/firmware/wlan/prima/WCNSS_qcom_cfg.ini': No such file or directory
    mkdir: cannot create directory '/etc/firmware': Permission denied
    ln: failed to create symbolic link '/etc/firmware/wcd9320/wcd9320_anc.bin': No such file or directory
    ln: failed to create symbolic link '/etc/firmware/wcd9320/wcd9320_mbhc.bin': No such file or directory
    ln: failed to create symbolic link '/etc/firmware/wcd9320/wcd9320_mad_audio.bin': No such file or directory
    mkdir: cannot create directory '/etc/firmware': Permission denied
    ln: failed to create symbolic link '/etc/firmware/wlan/prima/WCNSS_qcom_cfg.ini': No such file or directory
    mkdir: cannot create directory '/etc/firmware': Permission denied
    ln: failed to create symbolic link '/etc/firmware/wcd9320/wcd9320_anc.bin': No such file or directory
    ln: failed to create symbolic link '/etc/firmware/wcd9320/wcd9320_mbhc.bin': No such file or directory
    ln: failed to create symbolic link '/etc/firmware/wcd9320/wcd9320_mad_audio.bin': No such file or directory
    mkdir: cannot create directory '/etc/firmware': Permission denied
    ln: failed to create symbolic link '/etc/firmware/wlan/prima/WCNSS_qcom_cfg.ini': No such file or directory
    mkdir: cannot create directory '/etc/firmware': Permission denied
    ln: failed to create symbolic link '/etc/firmware/wcd9320/wcd9320_anc.bin': No such file or directory
    ln: failed to create symbolic link '/etc/firmware/wcd9320/wcd9320_mbhc.bin': No such file or directory
    ln: failed to create symbolic link '/etc/firmware/wcd9320/wcd9320_mad_audio.bin': No such file or directory
    mkdir: cannot create directory '/etc/firmware': Permission denied
    ln: failed to create symbolic link '/etc/firmware/wlan/prima/WCNSS_qcom_cfg.ini': No such file or directory
    mkdir: cannot create directory '/etc/firmware': Permission denied
    ln: failed to create symbolic link '/etc/firmware/wcd9320/wcd9320_anc.bin': No such file or directory
    ln: failed to create symbolic link '/etc/firmware/wcd9320/wcd9320_mbhc.bin': No such file or directory
    ln: failed to create symbolic link '/etc/firmware/wcd9320/wcd9320_mad_audio.bin': No such file or directory
    mkdir: cannot create directory '/etc/firmware': Permission denied
    ln: failed to create symbolic link '/etc/firmware/wlan/prima/WCNSS_qcom_cfg.ini': No such file or directory

    PLATFORM_VERSION_CODENAME=REL
    PLATFORM_VERSION=4.4.2
    TARGET_PRODUCT=aosp_bacon
    TARGET_BUILD_VARIANT=userdebug
    TARGET_BUILD_TYPE=release
    TARGET_BUILD_APPS=
    TARGET_ARCH=arm
    TARGET_ARCH_VARIANT=armv7-a-neon
    TARGET_CPU_VARIANT=krait
    HOST_ARCH=x86
    HOST_OS=linux
    HOST_OS_EXTRA=Linux-2.6.32-042stab094.7-x86_64-with-Ubuntu-14.04-trusty
    HOST_BUILD_TYPE=release
    BUILD_ID=KOT49H
    OUT_DIR=/var/lib/jenkins/phablet/out

    mkdir: cannot create directory '/etc/firmware': Permission denied
    ln: failed to create symbolic link '/etc/firmware/wcd9320/wcd9320_anc.bin': No such file or directory
    ln: failed to create symbolic link '/etc/firmware/wcd9320/wcd9320_mbhc.bin': No such file or directory
    ln: failed to create symbolic link '/etc/firmware/wcd9320/wcd9320_mad_audio.bin': No such file or directory
    mkdir: cannot create directory '/etc/firmware': Permission denied
    ln: failed to create symbolic link '/etc/firmware/wlan/prima/WCNSS_qcom_cfg.ini': No such file or directory

    PLATFORM_VERSION_CODENAME=REL
    PLATFORM_VERSION=4.4.2
    TARGET_PRODUCT=aosp_bacon
    TARGET_BUILD_VARIANT=userdebug
    TARGET_BUILD_TYPE=release
    TARGET_BUILD_APPS=
    TARGET_ARCH=arm
    TARGET_ARCH_VARIANT=armv7-a-neon
    TARGET_CPU_VARIANT=krait
    HOST_ARCH=x86
    HOST_OS=linux
    HOST_OS_EXTRA=Linux-2.6.32-042stab094.7-x86_64-with-Ubuntu-14.04-trusty
    HOST_BUILD_TYPE=release
    BUILD_ID=KOT49H
    OUT_DIR=/var/lib/jenkins/phablet/out

    including abi/cpp/Android.mk ...
    including bionic/Android.mk ...
    including bootable/recovery/Android.mk ...
    including build/libs/host/Android.mk ...
    including build/target/board/Android.mk ...
    including build/tools/acp/Android.mk ...
    including build/tools/check_prereq/Android.mk ...
    including build/tools/fs_config/Android.mk ...
    including build/tools/zipalign/Android.mk ...
    including device/asus/deb/dumpstate/Android.mk ...
    including device/asus/deb/recovery/Android.mk ...
    including device/asus/deb/self-extractors/Android.mk ...
    including device/asus/flo/Android.mk ...
    including device/asus/grouper/Android.mk ...
    including device/asus/tilapia/recovery/Android.mk ...
    including device/asus/tilapia/self-extractors/Android.mk ...
    including device/generic/goldfish/audio/Android.mk ...
    including device/generic/goldfish/camera/Android.mk ...
    including device/generic/goldfish/gps/Android.mk ...
    including device/generic/goldfish/lights/Android.mk ...
    including device/generic/goldfish/opengl/Android.mk ...
    including device/generic/goldfish/power/Android.mk ...
    including device/generic/goldfish/qemu-props/Android.mk ...
    including device/generic/goldfish/qemud/Android.mk ...
    including device/generic/goldfish/sensors/Android.mk ...
    including device/lge/hammerhead/Android.mk ...
    including device/lge/mako/Android.mk ...
    including device/samsung/manta/Android.mk ...
    including external/aac/Android.mk ...
    including external/busybox/Android.mk ...
    including external/bzip2/Android.mk ...
    including external/checkpolicy/Android.mk ...
    including external/e2fsprogs/Android.mk ...
    including external/expat/Android.mk ...
    including external/flac/Android.mk ...
    including external/freetype/Android.mk ...
    including external/fsck_msdos/Android.mk ...
    including external/gcc-demangle/Android.mk ...
    including external/genext2fs/Android.mk ...
    including external/giflib/Android.mk ...
    including external/gtest/Android.mk ...
    including external/icu4c/Android.mk ...
    including external/jhead/Android.mk ...
    including external/jpeg/Android.mk ...
    including external/libgsm/Android.mk ...
    including external/liblzf/Android.mk ...
    including external/libpng/Android.mk ...
    including external/libselinux/Android.mk ...
    including external/libsepol/Android.mk ...
    including external/libvpx/Android.mk ...
    including external/mksh/Android.mk ...
    including external/openssl/Android.mk ...
    including external/pigz/Android.mk ...
    including external/protobuf/Android.mk ...
    including external/qemu/Android.mk ...
    including external/scrypt/Android.mk ...
    including external/sepolicy/Android.mk ...
    including external/sfntly/Android.mk ...
    including external/skia/Android.mk ...
    including external/sonivox/Android.mk ...
    including external/speex/Android.mk ...
    including external/sqlite/android/Android.mk ...
    including external/sqlite/dist/Android.mk ...
    including external/stlport/Android.mk ...
    including external/tinyalsa/Android.mk ...
    including external/tinycompress/Android.mk ...
    including external/tremolo/Android.mk ...
    including external/webp/Android.mk ...
    including external/webrtc/Android.mk ...
    including external/wpa_supplicant_8/Android.mk ...
    including external/yaffs2/Android.mk ...
    including external/zlib/Android.mk ...
    including frameworks/av/camera/Android.mk ...
    including frameworks/av/drm/common/Android.mk ...
    including frameworks/av/drm/drmserver/Android.mk ...
    including frameworks/av/drm/libdrmframework/Android.mk ...
    including frameworks/av/drm/mediadrm/plugins/mock/Android.mk ...
    including frameworks/av/media/common_time/Android.mk ...
    including frameworks/av/media/libcpustats/Android.mk ...
    including frameworks/av/media/libeffects/downmix/Android.mk ...
    including frameworks/av/media/libeffects/factory/Android.mk ...
    including frameworks/av/media/libeffects/loudness/Android.mk ...
    including frameworks/av/media/libeffects/lvm/lib/Android.mk ...
    including frameworks/av/media/libeffects/lvm/wrapper/Android.mk ...
    including frameworks/av/media/libeffects/preprocessing/Android.mk ...
    including frameworks/av/media/libeffects/proxy/Android.mk ...
    including frameworks/av/media/libeffects/visualizer/Android.mk ...
    including frameworks/av/media/libmedia/Android.mk ...
    including frameworks/av/media/libmediaplayerservice/Android.mk ...
    including frameworks/av/media/libnbaio/Android.mk ...
    including frameworks/av/media/libstagefright/Android.mk ...
    including frameworks/av/media/mediaserver/Android.mk ...
    including frameworks/av/services/audioflinger/Android.mk ...
    including frameworks/av/services/camera/libcameraservice/Android.mk ...
    including frameworks/av/services/medialog/Android.mk ...
    including frameworks/base/cmds/bootanimation/Android.mk ...
    including frameworks/base/cmds/screencap/Android.mk ...
    including frameworks/base/libs/androidfw/Android.mk ...
    including frameworks/base/services/input/Android.mk ...
    including frameworks/base/tools/aapt/Android.mk ...
    including frameworks/native/cmds/installd/Android.mk ...
    including frameworks/native/cmds/servicemanager/Android.mk ...
    including frameworks/native/libs/binder/Android.mk ...
    including frameworks/native/libs/diskusage/Android.mk ...
    including frameworks/native/libs/gui/Android.mk ...
    including frameworks/native/libs/input/Android.mk ...
    including frameworks/native/libs/ui/Android.mk ...
    including frameworks/native/opengl/libagl/Android.mk ...
    including frameworks/native/opengl/libs/Android.mk ...
    including frameworks/native/opengl/tests/Android.mk ...
    including frameworks/native/services/batteryservice/Android.mk ...
    including frameworks/native/services/connectivitymanager/Android.mk ...
    including frameworks/native/services/powermanager/Android.mk ...
    including frameworks/native/services/sensorservice/Android.mk ...
    including frameworks/native/services/surfaceflinger/Android.mk ...
    including frameworks/opt/emoji/Android.mk ...
    including hardware/akm/AK8975_FS/akmdfs/Android.mk ...
    including hardware/akm/AK8975_FS/libsensors/Android.mk ...
    including hardware/broadcom/libbt/Android.mk ...
    including hardware/broadcom/wlan/bcmdhd/Android.mk ...
    including hardware/invensense/Android.mk ...
    including hardware/libhardware/Android.mk ...
    including hardware/libhardware_legacy/Android.mk ...
    including hardware/qcom/audio/Android.mk ...
    including hardware/qcom/bt/Android.mk ...
    including hardware/qcom/camera/Android.mk ...
    including hardware/qcom/display/Android.mk ...
    build/core/copy_headers.mk:15: warning: overriding commands for target /var/lib/jenkins/phablet/out/target/product/bacon/obj/include/qcom/display/copybit.h' build/core/copy_headers.mk:15: warning: ignoring old commands for target/var/lib/jenkins/phablet/out/target/product/bacon/obj/include/qcom/display/copybit.h'
    build/core/copy_headers.mk:15: warning: overriding commands for target /var/lib/jenkins/phablet/out/target/product/bacon/obj/include/qcom/display/copybit_priv.h' build/core/copy_headers.mk:15: warning: ignoring old commands for target/var/lib/jenkins/phablet/out/target/product/bacon/obj/include/qcom/display/copybit_priv.h'
    including hardware/qcom/keymaster/Android.mk ...
    including hardware/qcom/media-caf-new/Android.mk ...
    including hardware/qcom/power/Android.mk ...
    including hardware/qcom/wlan/qcwcn/Android.mk ...
    including hardware/ril/libril/Android.mk ...
    including hardware/ril/librilutils/Android.mk ...
    including hardware/ril/reference-ril/Android.mk ...
    including hardware/ril/rild/Android.mk ...
    including hardware/samsung_slsi/exynos5/Android.mk ...
    including hardware/ti/omap3/Android.mk ...
    including hardware/ti/omap4xxx/Android.mk ...
    including hardware/ti/wlan/mac80211/Android.mk ...
    including hardware/ti/wpan/Android.mk ...
    including prebuilts/tools/linux-x86/sdl/Android.mk ...
    including sdk/emulator/mksdcard/Android.mk ...
    including sdk/emulator/opengl/Android.mk ...
    including sdk/emulator/qtools/Android.mk ...
    including system/core/Android.mk ...
    including system/extras/ext4_utils/Android.mk ...
    including system/media/audio_route/Android.mk ...
    including system/media/audio_utils/Android.mk ...
    including system/media/camera/src/Android.mk ...
    including system/media/camera/tests/Android.mk ...
    including system/security/keystore/Android.mk ...
    including system/security/softkeymaster/Android.mk ...
    including system/vold/Android.mk ...
    including ubuntu/assets/Android.mk ...
    including ubuntu/libhybris/compat/camera/Android.mk ...
    including ubuntu/libhybris/compat/input/Android.mk ...
    including ubuntu/libhybris/compat/media/Android.mk ...
    including ubuntu/libhybris/compat/surface_flinger/Android.mk ...
    including ubuntu/libhybris/compat/ui/Android.mk ...
    including ubuntu/platform-api/android/hybris/Android.mk ...
    including ubuntu/upstart-property-watcher/Android.mk ...
    build/core/Makefile:32: warning: overriding commands for target /var/lib/jenkins/phablet/out/target/product/bacon/system/etc/apns-conf.xml' build/core/base_rules.mk:529: warning: ignoring old commands for target/var/lib/jenkins/phablet/out/target/product/bacon/system/etc/apns-conf.xml'
    PRODUCT_COPY_FILES device/sample/etc/apns-full-conf.xml:system/etc/apns-conf.xml ignored.
    PRODUCT_COPY_FILES device/oppo/msm8974-common/audio/audio_policy.conf:system/etc/audio_policy.conf ignored.
    PRODUCT_COPY_FILES device/oppo/msm8974-common/audio/mixer_paths.xml:system/etc/mixer_paths.xml ignored.
    No private recovery resources for TARGET_DEVICE bacon
    device/oneplus/bacon/mkbootimg.mk:47: warning: overriding commands for target /var/lib/jenkins/phablet/out/target/product/bacon/boot.img' build/core/Makefile:489: warning: ignoring old commands for target/var/lib/jenkins/phablet/out/target/product/bacon/boot.img'
    make  -C kernel/oneplus/msm8974 O=/var/lib/jenkins/phablet/out/target/product/bacon/obj/KERNEL_OBJ ARCH=arm CROSS_COMPILE=" /var/lib/jenkins/phablet/prebuilts/gcc/linux-x86/arm/arm-eabi-4.7/bin/arm-eabi-" VARIANT_DEFCONFIG= SELINUX_DEFCONFIG= cyanogenmod_bacon_defconfig
    make[1]: Entering directory `/var/lib/jenkins/phablet/kernel/oneplus/msm8974'
     GEN     /var/lib/jenkins/phablet/out/target/product/bacon/obj/KERNEL_OBJ/Makefile
    arch/arm/configs/cyanogenmod_bacon_defconfig:3598:warning: override: reassigning to symbol DEFAULT_SECURITY
    arch/arm/configs/cyanogenmod_bacon_defconfig:3605:warning: override: reassigning to symbol DEFAULT_MMAP_MIN_ADDR
    arch/arm/configs/cyanogenmod_bacon_defconfig:3606:warning: override: reassigning to symbol DEFAULT_IOSCHED

    configuration written to .config

    make[1]: Leaving directory /var/lib/jenkins/phablet/kernel/oneplus/msm8974' make  -C kernel/oneplus/msm8974 O=/var/lib/jenkins/phablet/out/target/product/bacon/obj/KERNEL_OBJ ARCH=arm CROSS_COMPILE=" /var/lib/jenkins/phablet/prebuilts/gcc/linux-x86/arm/arm-eabi-4.7/bin/arm-eabi-" headers_install make[1]: Entering directory/var/lib/jenkins/phablet/kernel/oneplus/msm8974'
     CHK     include/linux/version.h
    make[1]: Leaving directory /var/lib/jenkins/phablet/kernel/oneplus/msm8974' make  -C kernel/oneplus/msm8974 O=/var/lib/jenkins/phablet/out/target/product/bacon/obj/KERNEL_OBJ ARCH=arm CROSS_COMPILE=" /var/lib/jenkins/phablet/prebuilts/gcc/linux-x86/arm/arm-eabi-4.7/bin/arm-eabi-" zImage make[1]: Entering directory/var/lib/jenkins/phablet/kernel/oneplus/msm8974'
     GEN     /var/lib/jenkins/phablet/out/target/product/bacon/obj/KERNEL_OBJ/Makefile
    scripts/kconfig/conf --silentoldconfig Kconfig
     Using /var/lib/jenkins/phablet/kernel/oneplus/msm8974 as source for kernel
     GEN     /var/lib/jenkins/phablet/out/target/product/bacon/obj/KERNEL_OBJ/Makefile
     CHK     include/linux/version.h
     CHK     include/generated/utsrelease.h
    make[3]: include/generated/mach-types.h' is up to date.  CALL    /var/lib/jenkins/phablet/kernel/oneplus/msm8974/scripts/checksyscalls.sh  CHK     include/generated/compile.h  GZIP    kernel/config_data.gz  CHK     kernel/config_data.h  Kernel: arch/arm/boot/Image is ready  XZKERN  arch/arm/boot/compressed/piggy.xzkern  AS      arch/arm/boot/compressed/piggy.xzkern.o  LD      arch/arm/boot/compressed/vmlinux  OBJCOPY arch/arm/boot/zImage  Kernel: arch/arm/boot/zImage is ready make[1]: Leaving directory/var/lib/jenkins/phablet/kernel/oneplus/msm8974'
    make  -C kernel/oneplus/msm8974 O=/var/lib/jenkins/phablet/out/target/product/bacon/obj/KERNEL_OBJ ARCH=arm CROSS_COMPILE=" /var/lib/jenkins/phablet/prebuilts/gcc/linux-x86/arm/arm-eabi-4.7/bin/arm-eabi-" modules
    make[1]: Entering directory `/var/lib/jenkins/phablet/kernel/oneplus/msm8974'

    The present kernel configuration has modules disabled.
    Type 'make config' and enable loadable module support.
    Then build a kernel with module support enabled.

    make[2]: *** [modules] Error 1
    make[1]: *** [sub-make] Error 2
    make[1]: Leaving directory /var/lib/jenkins/phablet/kernel/oneplus/msm8974' make: [TARGET_KERNEL_BINARIES] Error 2 (ignored) make  -C kernel/oneplus/msm8974 O=/var/lib/jenkins/phablet/out/target/product/bacon/obj/KERNEL_OBJ INSTALL_MOD_PATH=../../system ARCH=arm CROSS_COMPILE=" /var/lib/jenkins/phablet/prebuilts/gcc/linux-x86/arm/arm-eabi-4.7/bin/arm-eabi-" modules_install make[1]: Entering directory/var/lib/jenkins/phablet/kernel/oneplus/msm8974'

    The present kernel configuration has modules disabled.
    Type 'make config' and enable loadable module support.
    Then build a kernel with module support enabled.

    make[2]: *** [modules_install] Error 1
    make[1]: *** [sub-make] Error 2
    make[1]: Leaving directory /var/lib/jenkins/phablet/kernel/oneplus/msm8974' make: [TARGET_KERNEL_BINARIES] Error 2 (ignored) mdpath=find /var/lib/jenkins/phablet/out/target/product/bacon/system/lib/modules -type f -name modules.order; if [ "$mdpath" != "" ];then mpath=dirname $mdpath; ko=find $mpath/kernel -type f -name *.ko; for i in $ko; do /var/lib/jenkins/phablet/prebuilts/gcc/linux-x86/arm/arm-eabi-4.7/bin/arm-eabi-strip --strip-unneeded $i; mv $i /var/lib/jenkins/phablet/out/target/product/bacon/system/lib/modules/; done; fi find:/var/lib/jenkins/phablet/out/target/product/bacon/system/lib/modules': No such file or directory
    mdpath=find /var/lib/jenkins/phablet/out/target/product/bacon/system/lib/modules -type f -name modules.order; if [ "$mdpath" != "" ];then mpath=dirname $mdpath; rm -rf $mpath; fi
    find: /var/lib/jenkins/phablet/out/target/product/bacon/system/lib/modules': No such file or directory mdpath=find /var/lib/jenkins/phablet/out/target/product/bacon/system/lib/modules -type f -name modules.order; if [ "$mdpath" != "" ];then mpath=dirname $mdpath; ko=find $mpath/kernel -type f -name *.ko; for i in $ko; do /var/lib/jenkins/phablet/prebuilts/gcc/linux-x86/arm/arm-eabi-4.7/bin/arm-eabi-strip --strip-unneeded $i; mv $i /var/lib/jenkins/phablet/out/target/product/bacon/system/lib/modules/; done; fi find:/var/lib/jenkins/phablet/out/target/product/bacon/system/lib/modules': No such file or directory
    mdpath=find /var/lib/jenkins/phablet/out/target/product/bacon/system/lib/modules -type f -name modules.order; if [ "$mdpath" != "" ];then mpath=dirname $mdpath; rm -rf $mpath; fi
    find: `/var/lib/jenkins/phablet/out/target/product/bacon/system/lib/modules': No such file or directory
    target Prebuilt:  (/var/lib/jenkins/phablet/out/target/product/bacon/kernel)
    build/tools/generate-notice-files.py  /var/lib/jenkins/phablet/out/target/product/bacon/obj/NOTICE.txt  /var/lib/jenkins/phablet/out/target/product/bacon/obj/NOTICE.html "Notices for files contained in the filesystem images in this directory:" /var/lib/jenkins/phablet/out/target/product/bacon/obj/NOTICE_FILES/src
    Combining NOTICE files into HTML
    Combining NOTICE files into text
    Start DT image: /var/lib/jenkins/phablet/out/target/product/bacon/dt.img
    mkdir -p /var/lib/jenkins/phablet/out/target/product/bacon/obj/KERNEL_OBJ/arch/arm/boot;   /var/lib/jenkins/phablet/out/target/product/bacon/obj/KERNEL_OBJ/scripts/dtc/dtc -p 1024 -O dtb -o /var/lib/jenkins/phablet/out/target/product/bacon/obj/KERNEL_OBJ/arch/arm/boot/msm8974pro-ab-pm8941-a0001.dtb ./kernel/oneplus/msm8974/arch/arm/boot/dts/msm8974pro-ab-pm8941-a0001.dts; cat /var/lib/jenkins/phablet/out/target/product/bacon/obj/KERNEL_OBJ/arch/arm/boot/zImage /var/lib/jenkins/phablet/out/target/product/bacon/obj/KERNEL_OBJ/arch/arm/boot/msm8974pro-ab-pm8941-a0001.dtb > /var/lib/jenkins/phablet/out/target/product/bacon/obj/KERNEL_OBJ/arch/arm/boot/msm8974pro-ab-pm8941-a0001-zImage;  /var/lib/jenkins/phablet/out/target/product/bacon/obj/KERNEL_OBJ/scripts/dtc/dtc -p 1024 -O dtb -o /var/lib/jenkins/phablet/out/target/product/bacon/obj/KERNEL_OBJ/arch/arm/boot/msm8974pro-ac-pm8941-a0001.dtb ./kernel/oneplus/msm8974/arch/arm/boot/dts/msm8974pro-ac-pm8941-a0001.dts; cat /var/lib/jenkins/phablet/out/target/product/bacon/obj/KERNEL_OBJ/arch/arm/boot/zImage /var/lib/jenkins/phablet/out/target/product/bacon/obj/KERNEL_OBJ/arch/arm/boot/msm8974pro-ac-pm8941-a0001.dtb > /var/lib/jenkins/phablet/out/target/product/bacon/obj/KERNEL_OBJ/arch/arm/boot/msm8974pro-ac-pm8941-a0001-zImage;
    Warning (reg_format): "reg" property in /soc/spi@f9923000 is empty
    Warning (reg_format): "reg" property in /soc/spi@f9923000 is empty
    Target dt image: /var/lib/jenkins/phablet/out/target/product/bacon/dt.img
    DTB combiner:
     Input directory: '/var/lib/jenkins/phablet/out/target/product/bacon/obj/KERNEL_OBJ/arch/arm/boot/'
     Output file: '/var/lib/jenkins/phablet/out/target/product/bacon/dt.img'
    Found file: msm8974pro-ab-pm8941-a0001.dtb ... chipset: 208, rev: 65536, platform: 8, subtype: 0
      additional chipset: 209, rev: 65536, platform: 8, subtype: 0
      additional chipset: 211, rev: 65536, platform: 8, subtype: 0
      additional chipset: 212, rev: 65536, platform: 8, subtype: 0
      additional chipset: 214, rev: 65536, platform: 8, subtype: 0
      additional chipset: 215, rev: 65536, platform: 8, subtype: 0
      additional chipset: 217, rev: 65536, platform: 8, subtype: 0
      additional chipset: 218, rev: 65536, platform: 8, subtype: 0
    Found file: msm8974pro-ac-pm8941-a0001.dtb ... chipset: 194, rev: 65536, platform: 8, subtype: 0
      additional chipset: 210, rev: 65536, platform: 8, subtype: 0
      additional chipset: 213, rev: 65536, platform: 8, subtype: 0
      additional chipset: 216, rev: 65536, platform: 8, subtype: 0
    => Found 12 unique DTB(s)

    Generating master DTB... completed
    Made DT image: /var/lib/jenkins/phablet/out/target/product/bacon/dt.img
    Target Ubuntu Touch ram disk: /var/lib/jenkins/phablet/out/target/product/bacon/ramdisk.img
    Downloading ubuntu-touch-generic-initrd version 0.94
    14610 blocks
    ----- Making recovery image ------
    Copying baseline ramdisk...
    Modifying ramdisk contents...
    cp: cannot stat '/var/lib/jenkins/phablet/out/target/product/bacon/root/init.recovery..rc': No such file or directory
    make: [/var/lib/jenkins/phablet/out/target/product/bacon/recovery/root.ts] Error 1 (ignored)
    mkdir -p /var/lib/jenkins/phablet/out/target/product/bacon/recovery/root/system/bin
    Modifying default.prop
    sed -i 's/ro.build.date.utc=.
    /ro.build.date.utc=0/g' /var/lib/jenkins/phablet/out/target/product/bacon/recovery/root/default.prop
    sed -i 's/ro.adb.secure=1//g' /var/lib/jenkins/phablet/out/target/product/bacon/recovery/root/default.prop
    ----- Made recovery filesystem --------/var/lib/jenkins/phablet/out/target/product/bacon/recovery/root
    ----- Making uncompressed recovery ramdisk ------
    /var/lib/jenkins/phablet/out/host/linux-x86/bin/mkbootfs /var/lib/jenkins/phablet/out/target/product/bacon/recovery/root > /var/lib/jenkins/phablet/out/target/product/bacon/ramdisk-recovery.cpio
    ----- Making recovery ramdisk ------
    /var/lib/jenkins/phablet/out/host/linux-x86/bin/minigzip < /var/lib/jenkins/phablet/out/target/product/bacon/ramdisk-recovery.cpio > /var/lib/jenkins/phablet/out/target/product/bacon/ramdisk-recovery.img
    ----- Making recovery image ------
    usage: mkbootimg
          --kernel <filename>
          --ramdisk <filename>
          [ --second <2ndbootloader-filename> ]
          [ --cmdline <kernel-commandline> ]
          [ --board <boardname> ]
          [ --base <address> ]
          [ --pagesize <pagesize> ]
          -o|--output <filename>
    make: *** [/var/lib/jenkins/phablet/out/target/product/bacon/recovery.img] Error 1

    real 3m32.027s
    user 0m49.288s
    sys 0m14.751s
    Build step 'Execute shell' marked build as failure
    Finished: FAILURE[/code]

    [/quote]

    [color=#333333][font='Helvetica Neue', Helvetica, 'Segoe UI', Arial, freesans, sans-serif]Replace mkbootimg with this [/font][/color][url=https://github.com/ubuntu-touch-oneplus-one/ubuntu-touch-for-oneplus-one/blob/master/tools/mkbootimg?raw=true][color=#4078c0][font='Helvetica Neue', Helvetica, 'Segoe UI', Arial, freesans, sans-serif]https://github.com/ubuntu-touch-oneplus-one/ubuntu-touch-for-oneplus-one/blob/master/tools/mkbootimg?raw=true[/font][/color][/url][color=#333333][font='Helvetica Neue', Helvetica, 'Segoe UI', Arial, freesans, sans-serif] [/font][/color]

    [color=#333333][font='Helvetica Neue', Helvetica, 'Segoe UI', Arial, freesans, sans-serif]The folder where it's located is: "/out/host/linux-x86/bin"[/font][/color]



  • Please add a guide for multirom



  • [quote='bd2000' pid='57' dateline='1434368592']
    Please add a guide for multirom
    [/quote]

    This is not where you should ask for that, he will do it when it's totally ready.


Log in to reply
 

Looks like your connection to UBports Forum was lost, please wait while we try to reconnect.